{"text_format":"1","workbook":"xlsx","n_sheets":16,"sheets":["Instructions - Menu","App Checklist","Application Form","Program Eligibility Form","CRP Data","CEFW","CP2 Scoring","CP21 Scoring","CP23 Scoring","CP23a Scoring","Questionnaire & Assessment","Min Size Waiver","AppUploadTemplate","ApplicationQuestion","ApplicationPractice","Lists"],"not_rendered":{"charts":0,"images":12,"macros":1,"external_links":0,"defined_names":17,"comments":6,"pivot_tables":0},"unopened":[],"bounds":{"document_bytes":16777216,"sheet_cells":100000,"rows_first":2000,"rows_last":500,"rows_between":2000,"halvings":0,"cell_chars":16384,"cell_head_chars":4096},"cells_cut":0,"cells_raw":0,"read":"whole","date_system":"1900"}

{"sheet":"Instructions - Menu","index":0,"n_rows":40,"n_cols":7,"rows_kept":40,"cut":false,"hidden":false,"merged":[[34,15,36,20],[35,8,35,12],[34,8,34,12],[12,2,12,12],[23,2,23,6],[26,2,26,6],[27,2,27,6],[22,2,22,6],[13,2,13,12],[14,2,14,12],[1,1,1,2],[2,2,2,12],[6,2,6,13],[3,2,3,12],[10,2,11,12],[8,2,8,12],[4,6,4,8],[39,1,39,3],[20,2,20,6],[19,2,19,6],[19,8,19,12],[20,8,20,12],[37,2,37,6]]}
[]
[]
[null,null,"RIM MN-CREP Workbook"]
[null,null," Application Documents File"]
[null,null,null,null,null,null,"EasApp_v07"]
[null,null,"Instructions:"]
{"$rows_left_out":35}
{"sheet":"App Checklist","index":1,"n_rows":53,"n_cols":16,"rows_kept":53,"cut":false,"hidden":false,"merged":[[20,3,20,10],[21,3,21,10],[22,3,22,10],[24,3,24,10],[33,3,33,10],[28,3,28,10],[29,3,29,10],[30,3,30,10],[32,3,32,10],[52,1,52,4],[51,2,51,10],[1,1,1,3],[13,3,13,9],[14,3,14,9],[18,3,18,10],[19,3,19,10],[2,1,2,10],[3,1,3,10],[7,1,7,10],[6,3,6,7],[6,8,6,9],[5,3,5,7],[5,8,5,9],[25,3,25,10],[26,2,26,10]]}
[]
[]
[null,"RIM MN-CREP Workbook"]
[null," Application Checklist"]
[]
[null,null,null,"Landowner Name:",null,null,null,null,"County/SWCD Office:"]
{"$rows_left_out":48}
{"sheet":"Application Form","index":2,"n_rows":43,"n_cols":37,"rows_kept":43,"cut":false,"hidden":false,"merged":[[42,1,42,9],[39,3,39,13],[39,17,39,20],[23,8,23,11],[32,3,32,21],[36,2,36,15],[37,3,37,21],[31,2,31,13],[25,2,25,21],[11,2,11,8],[16,15,16,18],[15,15,15,18],[11,16,11,21],[11,13,11,15],[8,16,8,19],[9,13,9,15],[4,11,4,18],[7,15,7,18],[6,15,6,18],[6,19,6,21],[7,19,7,21],[23,32,23,36],[18,19,19,21],[21,19,22,21],[18,17,19,18],[21,17,22,18],[3,20,3,21],[2,20,2,21],[34,3,34,13],[34,17,34,20],[14,15,14,18],[13,13,13,14],[28,2,28,21],[29,2,29,21],[1,11,2,18],[3,10,3,18],[9,2,9,12],[4,3,4,9],[8,2,8,12],[7,2,7,10],[7,11,7,14],[9,16,9,19],[6,2,6,10],[6,11,6,14],[8,13,8,15],[18,2,19,5],[18,6,19,10],[17,4,17,12],[15,2,15,11],[16,2,16,11],[13,15,13,18],[10,9,10,12],[11,9,11,12],[10,16,10,21],[10,13,10,15],[13,2,13,11],[14,2,14,11],[10,2,10,8]]}
[]
[null,null,null,null,null,null,null,null,null,null,null,"STATE OF MINNESOTA"]
[]
[null,null,null,null,null,null,null,null,null,null,"CONSERVATION EASEMENT"]
[null,null,null,null,null,null,null,null,null,null,null,"Application Form"]
[]
{"$rows_left_out":38}
{"sheet":"Program Eligibility Form","index":3,"n_rows":54,"n_cols":10,"rows_kept":54,"cut":false,"hidden":false,"merged":[[1,1,1,3],[42,11,42,12],[8,1,8,13],[2,1,2,13],[4,1,4,13],[7,4,7,8],[6,9,6,11],[7,9,7,11],[6,4,6,8],[12,5,12,12],[14,5,14,12],[23,7,23,9],[18,7,19,11],[37,7,37,11],[20,3,21,12],[13,7,13,12],[53,1,53,5],[47,3,47,11],[43,3,44,12],[10,3,11,12],[29,3,31,12],[33,7,33,9],[39,3,40,12],[15,3,16,11],[51,3,51,12],[46,6,46,10],[49,7,49,11]]}
[]
[]
[null,"RIM MN-CREP Workbook"]
[]
[null,"Program Eligibility Form"]
[]
{"$rows_left_out":49}
{"sheet":"CRP Data","index":4,"n_rows":43,"n_cols":23,"rows_kept":43,"cut":false,"hidden":false,"merged":[[8,9,9,14],[12,5,12,9],[23,5,23,6],[24,5,24,6],[24,9,24,10],[25,9,25,10],[27,9,29,12],[23,9,23,10],[45,5,45,7],[38,8,38,9],[35,8,35,9],[39,11,39,13],[35,5,35,7],[36,5,36,7],[37,5,37,7],[33,8,33,9],[34,8,34,9],[34,11,34,12],[33,11,33,12],[28,3,28,8],[29,3,29,8],[16,3,16,4],[16,5,16,6],[16,7,16,8],[47,5,48,7],[18,3,18,4],[19,3,19,4],[20,3,20,4],[21,3,21,4],[22,3,22,4],[19,12,19,13],[20,12,20,13],[22,9,22,10],[22,12,22,13],[34,13,34,14],[42,1,42,4],[38,11,38,12],[43,3,43,14],[25,12,25,13],[24,12,24,13],[26,12,26,13],[39,8,39,9],[39,5,39,7],[40,5,40,7],[40,11,40,12],[36,8,36,9],[37,8,37,9],[38,5,38,7],[16,9,16,10],[26,9,26,10],[17,3,17,4],[23,3,23,4],[24,3,24,4],[25,3,25,4],[26,3,26,4],[17,9,17,10],[25,7,25,8],[26,7,26,8],[26,5,26,6],[19,5,19,6],[10,16,11,18],[13,16,14,18],[25,5,25,6],[17,5,17,6],[22,5,22,6],[18,7,18,8],[19,7,19,8],[20,7,20,8],[21,7,21,8],[22,7,22,8],[17,7,17,8],[20,9,20,10],[21,12,21,13],[11,6,11,7],[10,5,10,10],[15,3,15,6],[11,9,11,10],[23,12,23,13],[21,9,21,10],[24,7,24,8],[23,7,23,8],[17,12,17,13],[18,12,18,13],[13,12,14,15],[7,4,7,13],[6,4,6,8],[6,9,6,13],[2,1,2,15],[3,1,3,15],[5,4,5,8],[5,9,5,13],[33,5,33,7],[34,5,34,7],[10,3,10,4],[11,3,11,4],[13,3,13,4],[14,3,14,4],[13,5,13,8],[14,5,14,8],[13,9,13,11],[14,9,14,11],[16,12,16,14],[10,12,11,13],[20,5,20,6],[21,5,21,6],[18,5,18,6],[18,9,18,10],[19,9,19,10]]}
[]
[null,{"$f":"LastModified()","v":"2019-07-31T16:46:06"}]
[null,"RIM MN-CREP Workbook"]
[null,"CRP Data"]
[]
[null,null,null,null,"Landowner Name:",null,null,null,null,"County/SWCD Office:"]
{"$rows_left_out":38}
{"sheet":"CEFW","index":5,"n_rows":57,"n_cols":31,"rows_kept":57,"cut":false,"hidden":false,"merged":[[23,20,23,27],[11,20,11,23],[15,20,15,26],[27,2,27,6],[29,3,29,7],[22,2,25,4],[22,7,22,9],[22,13,22,15],[24,5,25,18],[5,4,5,10],[5,11,5,15],[11,2,11,4],[13,2,13,4],[15,2,15,4],[7,5,7,9],[7,11,7,15],[8,5,8,9],[8,11,8,15],[8,2,9,4],[1,1,1,6],[2,1,2,19],[3,1,3,19],[4,4,4,9],[4,11,4,15],[56,1,56,4],[44,14,44,18],[46,14,46,18],[48,14,48,18],[50,14,50,18],[53,35,53,36],[53,29,53,30],[39,3,39,7],[38,3,38,7],[43,21,43,23],[41,21,42,23],[40,21,40,22],[38,21,38,23],[39,10,39,14],[43,9,43,12],[38,24,38,25],[41,24,42,25],[40,10,41,17],[38,10,38,14],[37,3,37,7],[48,21,48,23],[49,21,50,23],[44,21,46,23],[44,24,46,25],[37,21,37,23],[48,24,48,25],[36,21,36,23],[36,24,36,25],[43,24,43,25],[39,24,39,25],[40,24,40,25],[33,8,33,9],[31,3,31,7],[32,3,32,7],[35,2,35,6],[11,30,11,35],[13,30,13,35],[15,30,15,35],[23,30,23,37],[28,21,28,26],[29,21,34,26],[20,2,20,4],[17,2,17,4],[20,7,20,16],[30,3,30,7],[17,7,18,9],[19,7,19,17]]}
[null,null,null,null,null,null,null,"x"]
[]
[null,"RIM MN-CREP Workbook"]
[null,"Conservation Easement Financial Worksheet (CEFW)"]
[null,null,null,null,"Landowner Name:",null,null,null,null,null,null,"County/SWCD Office:"]
[null,null,null,null,{"$f":"IF(AND(ISBLANK('Application Form'!C8),NOT(ISBLANK('Application Form'!L8))),'Application Form'!L8,IF(AND(NOT(ISBLANK('Application Form'!C8)),NOT(ISBLANK('Application Form'!L8))),'Application Form'!C8&\" \"&'Application Form'!L8,\"\"))","v":""},null,null,null,null,null,null,{"$f":"IF(ISBLANK('Application Form'!T8),\"\",'Application Form'!T8)","v":""}]
{"$rows_left_out":52}
{"sheet":"CP2 Scoring","index":6,"n_rows":30,"n_cols":25,"rows_kept":30,"cut":false,"hidden":false,"merged":[[32,10,32,12],[34,13,34,14],[23,5,23,11],[24,5,24,11],[25,5,25,11],[26,5,26,11],[29,1,29,6],[1,1,1,6],[4,4,4,14],[6,5,6,8],[6,9,6,13],[7,3,7,6],[7,7,7,8],[7,9,7,12],[7,13,7,14],[5,9,5,13],[22,5,22,11],[29,13,29,14],[11,3,13,11],[17,3,20,11],[2,1,2,15],[3,1,3,15],[8,4,8,9],[8,10,8,15],[9,9,9,13],[14,12,14,14],[5,5,5,8]]}
[]
[]
[null,"RIM WELLHEAD PROTECTION AREAS - CP2"]
[null," ENVIRONMENTAL BENEFITS SCORING SHEET"]
[]
[null,null,null,null,null,"Landowner Name:",null,null,null,"County/SWCD Office:"]
{"$rows_left_out":25}
{"sheet":"CP21 Scoring","index":7,"n_rows":69,"n_cols":40,"rows_kept":69,"cut":false,"hidden":false,"merged":[[1,1,1,6],[4,4,4,14],[52,3,52,9],[8,4,8,9],[8,10,8,15],[43,6,45,6],[43,7,44,10],[24,5,24,11],[28,5,28,11],[29,5,29,11],[9,9,9,13],[13,12,13,14],[20,5,20,11],[21,5,21,11],[25,6,27,11],[22,5,22,11],[68,13,68,14],[71,10,71,12],[73,13,73,14],[65,13,65,14],[66,4,66,14],[68,1,68,6],[23,5,23,11],[57,6,59,6],[57,7,58,10],[30,5,30,11],[31,5,31,11],[32,5,32,11],[53,3,56,11],[36,1,36,15],[37,1,37,15],[39,3,41,11],[2,1,2,15],[3,1,3,15],[6,5,6,8],[6,9,6,13],[7,3,7,6],[7,7,7,8],[7,9,7,12],[7,13,7,14],[5,9,5,13],[5,5,5,8]]}
[]
[null,null,null,null,null,null,null,null,null,null,null,null,null,null,null,"Sheet 1 of 2  "]
[null,"RIM FILTER STRIP - CP21"]
[null," ENVIRONMENTAL BENEFITS SCORING SHEET"]
[]
[null,null,null,null,null,"Landowner Name:",null,null,null,"County/SWCD Office:"]
{"$rows_left_out":64}
{"sheet":"CP23 Scoring","index":8,"n_rows":70,"n_cols":41,"rows_kept":70,"cut":false,"hidden":false,"merged":[[14,2,14,5],[14,9,14,10],[14,14,14,15],[6,4,6,8],[6,9,6,14],[7,2,7,6],[7,7,7,8],[7,9,7,12],[7,13,7,15],[8,3,8,9],[8,10,8,16],[9,9,9,13],[11,2,11,9],[12,12,12,15],[1,1,1,5],[4,3,4,15],[5,9,5,14],[2,1,2,16],[3,1,3,16],[5,4,5,8],[16,14,16,15],[16,2,24,4],[16,5,17,5],[16,9,16,10],[17,9,17,10],[17,14,17,15],[18,9,24,10],[18,14,18,15],[19,14,19,15],[20,14,20,15],[21,14,21,15],[22,14,22,15],[23,14,23,15],[24,14,24,15],[16,11,24,11],[16,13,24,13],[27,3,27,13],[28,2,28,5],[28,9,28,10],[30,2,36,4],[31,9,31,10],[56,2,57,14],[74,13,74,15],[63,3,63,14],[64,3,64,14],[65,3,65,14],[67,2,67,15],[69,13,69,15],[69,1,69,5],[72,10,72,12],[53,2,53,11],[41,7,47,7],[42,2,42,5],[43,2,43,4],[44,2,44,4],[45,2,45,4],[46,2,46,4],[51,1,51,16],[52,1,52,16],[41,8,42,15],[55,2,55,7],[30,5,31,5],[30,9,30,10],[62,3,62,14],[43,8,43,15],[44,8,44,15],[46,8,46,15],[41,2,41,5],[45,8,45,15],[39,2,39,9],[32,9,36,10],[59,2,59,9],[60,2,60,15],[61,3,61,14],[30,11,36,11],[47,2,47,4]]}
[]
[null,null,null,null,null,null,null,null,null,null,null,null,null,null,null,null,"Sheet 1 of 2  "]
[null,"RIM FLOODPLAIN WETLANDS - CP23"]
[null," ENVIRONMENTAL BENEFITS SCORING SHEET"]
[]
[null,null,null,null,"Landowner Name:",null,null,null,null,"County/SWCD Office:"]
{"$rows_left_out":65}
{"sheet":"CP23a Scoring","index":9,"n_rows":70,"n_cols":41,"rows_kept":70,"cut":false,"hidden":false,"merged":[[44,2,44,4],[55,2,56,14],[18,9,24,10],[28,2,28,5],[43,2,43,4],[30,11,36,11],[41,2,41,5],[42,2,42,5],[42,8,42,12],[32,12,34,12],[41,8,41,12],[45,2,45,4],[51,1,51,16],[30,2,36,4],[32,14,32,15],[30,14,30,15],[14,14,14,15],[41,7,47,7],[17,14,17,15],[22,14,22,15],[23,14,23,15],[24,14,24,15],[14,9,14,10],[16,14,16,15],[16,11,24,11],[19,14,19,15],[20,14,20,15],[21,14,21,15],[31,9,31,10],[17,9,17,10],[28,14,28,15],[36,14,36,15],[12,12,12,15],[7,7,7,8],[4,3,4,15],[7,9,7,12],[6,4,6,8],[8,10,8,16],[7,13,7,15],[7,2,7,6],[9,9,9,13],[31,14,31,15],[38,14,38,15],[33,14,33,15],[34,14,34,15],[35,14,35,15],[37,14,37,15],[43,8,43,9],[44,8,44,9],[45,8,45,9],[46,8,46,9],[47,8,47,9],[74,13,74,15],[72,10,72,12],[69,13,69,15],[27,3,27,13],[54,2,54,8],[39,2,39,9],[58,2,58,9],[28,9,28,10],[65,3,65,14],[63,3,63,14],[67,2,67,15],[52,2,52,11],[64,3,64,14],[62,3,62,14],[61,3,61,14],[60,3,60,14],[1,1,1,5],[8,3,8,9],[5,9,5,14],[6,9,6,14],[11,2,11,9],[5,4,5,8],[69,1,69,4],[2,1,2,16],[3,1,3,16],[50,1,50,16],[16,2,24,4],[14,2,14,5],[16,5,17,5],[16,13,24,13],[18,14,18,15],[16,9,16,10],[59,2,59,15],[30,9,30,10],[30,5,31,5],[46,2,46,4],[47,2,47,4],[32,9,36,10]]}
[]
[null,null,null,null,null,null,null,null,null,null,null,null,null,null,null,null,"Sheet 1 of 2  "]
[null,"RIM WETLANDS PROGRAM - CP23a"]
[null," ENVIRONMENTAL BENEFITS SCORING SHEET"]
[]
[null,null,null,null,"Landowner Name:",null,null,null,null,"County/SWCD Office:"]
{"$rows_left_out":65}
{"sheet":"Questionnaire & Assessment","index":10,"n_rows":57,"n_cols":27,"rows_kept":57,"cut":false,"hidden":false,"merged":[[55,4,55,11],[54,4,54,11],[48,8,48,11],[31,2,31,5],[43,10,43,11],[46,10,46,11],[52,8,52,11],[41,2,41,3],[36,2,36,5],[51,8,51,11],[37,8,37,11],[28,8,28,11],[1,1,1,5],[24,8,24,11],[20,8,20,12],[32,8,32,11],[8,1,8,12],[21,8,21,10],[19,8,19,10],[2,1,2,12],[3,1,3,12],[6,1,6,12],[4,9,4,10],[5,9,5,10],[4,5,4,8],[5,5,5,8],[10,8,10,10],[15,8,15,10],[16,8,16,12],[11,8,11,11],[12,8,12,10],[14,8,14,11],[13,8,13,10],[56,1,56,6],[40,8,40,10],[49,8,49,10],[53,8,53,10],[17,8,17,10],[22,8,22,10],[44,4,44,11],[45,4,45,11],[41,4,41,11],[42,4,42,11],[25,8,25,10],[31,8,31,10],[34,8,34,10],[39,8,39,11],[38,8,38,11],[26,8,26,11]]}
[]
[null,null,null,null,null,null,null,null,null,null,null,null,"Sheet 1 of 2"]
[null,"STATE OF MINNESOTA CONSERVATION EASEMENT"]
[null,"Landowner Questionnaire and Easement Area Assessment Form"]
[null,null,null,null,null,"Landowner Name:",null,null,null,"County/SWCD Office:"]
[null,null,null,null,null,{"$f":"IF(AND(ISBLANK('Application Form'!C8),NOT(ISBLANK('Application Form'!L8))),'Application Form'!L8,IF(AND(NOT(ISBLANK('Application Form'!C8)),NOT(ISBLANK('Application Form'!L8))),'Application Form'!C8&\" \"&'Application Form'!L8,\"\"))","v":""},null,null,null,{"$f":"IF(ISBLANK('Application Form'!T8),\"\",'Application Form'!T8)","v":""}]
{"$rows_left_out":52}
{"sheet":"Min Size Waiver","index":11,"n_rows":52,"n_cols":19,"rows_kept":52,"cut":false,"hidden":false,"merged":[[51,1,51,5],[50,3,50,8],[4,1,4,13],[6,4,6,8],[6,9,6,11],[36,3,38,12],[42,3,43,12],[46,3,46,6],[46,9,46,11],[17,3,18,12],[8,1,8,13],[14,5,14,12],[10,2,13,12],[30,3,31,12],[33,3,34,12],[1,1,1,4],[22,3,24,12],[7,4,7,8],[7,9,7,11],[2,1,2,13]]}
[]
[]
[null,"RIM MN-CREP Workbook"]
[]
[null,"RIM/CREP Minimum Size Waiver Worksheet"]
[]
{"$rows_left_out":47}
{"sheet":"AppUploadTemplate","index":12,"n_rows":2,"n_cols":43,"rows_kept":2,"cut":false,"hidden":true,"merged":[]}
["LAST_NAME_BUSINESS","FIRST_NAME","SPOUSE","COUNTY_FIELD_OFFICE","TOWNSHIP_NAME","TOWNSHIP1","RANGE1","SECTION1","TOWNSHIP2","RANGE2","SECTION2","PROJECT_NAME","ADDRESS1","ADDRESS_ATTN","CITY","STATE","ZIP","PHONE_NUM_HOME","PHONE_NUM_WORK","PHONE_NUM_CELL","EMAIL","EASEMENT_TYPE_CODE","EASEMENT_TOTAL_ACRES","CRP1_ACRES_FOR_ENROLLMENT","RIM_ONLY_CROP_ACRES","RIM_ONLY_NONCROP_ACRES","RIM_ONLY_CROP_CRP_ACRES","DONATED_ACRES","CRP_TOTAL_PAYMENT","RIM_TOTAL_PAYMENT","RIM_ONLY_CROP_PAYMENT","RIM_ONLY_NONCROP_PAYMENT","RIM_ONLY_CROP_CRP_PAYMENT","CREP_VALUE_MINUS_CRP_PAYMENT","LSOHC_PLANNING_UNIT","HUC12","WELLHEAD_PROTECTION_AREA","CRP1_CONTRACT_PERIOD_START","CRP1_CONTRACT_PERIOD_END","CRP1_PARTICANTS_SIGNATURE_DATE","MIN_SIZE_WAIVER","APP_WORKBOOK_VERSION","LAST_MODIFIED"]
[{"$f":"IF(ISBLANK('Application Form'!L8),\"\",TRIM(UPPER('Application Form'!L8)))","v":""},{"$f":"IF(ISBLANK('Application Form'!C8),\"\",TRIM(UPPER('Application Form'!C8)))","v":""},{"$f":"IF(ISBLANK('Application Form'!P8),\"\",TRIM(UPPER('Application Form'!P8)))","v":""},{"$f":"IF(ISBLANK('Application Form'!T8),\"\",INDEX(Lists!A2:A92,(MATCH('Application Form'!T8,SWCD,0)),0))","v":""},{"$f":"IF(ISBLANK('Application Form'!P15),\"\",TRIM(UPPER('Application Form'!P15)))","v":""},{"$f":"IF(ISBLANK('Application Form'!U15),\"\",'Application Form'!U15)","v":""},{"$f":"IF(ISBLANK('Application Form'!V15),\"\",'Application Form'!V15)","v":""},{"$f":"IF(ISBLANK('Application Form'!T15),\"\",'Application Form'!T15)","v":""},{"$f":"IF(ISBLANK('Application Form'!U17),\"\",'Application Form'!U17)","v":""},{"$f":"IF(ISBLANK('Application Form'!V17),\"\",'Application Form'!V17)","v":""},{"$f":"IF(ISBLANK('Application Form'!T17),\"\",'Application Form'!T17)","v":""},{"$f":"IF(ISBLANK('Application Form'!C15),\"\",UPPER('Application Form'!C15))","v":""},{"$f":"IF(ISBLANK('Application Form'!C10),\"\",TRIM(UPPER('Application Form'!C10)))","v":""},{"$f":"IF(ISBLANK('Application Form'!N10),\"\",TRIM(UPPER('Application Form'!N10)))","v":""},{"$f":"IF(ISBLANK('Application Form'!Q10),\"\",TRIM(UPPER('Application Form'!Q10)))","v":""},{"$f":"IF(ISBLANK('Application Form'!U10),\"\",TRIM(UPPER('Application Form'!U10)))","v":""},{"$f":"IF(ISBLANK('Application Form'!V10),\"\",TRIM('Application Form'!V10))","v":""},{"$f":"IF(ISBLANK('Application Form'!C12),\"\",'Application Form'!C12)","v":""},{"$f":"IF(ISBLANK('Application Form'!J12),\"\",'Application Form'!J12)","v":""},{"$f":"IF(ISBLANK('Application Form'!N12),\"\",'Application Form'!N12)","v":""},{"$f":"IF(ISBLANK('Application Form'!Q12),\"\",'Application Form'!Q12)","v":""},{"$f":"IF('CRP Data'!L35=\"CP2\",\"13\",IF('CRP Data'!L35=\"CP21\",\"10\",IF('CRP Data'!L35=\"CP23\",\"12\",IF('CRP Data'!L35=\"CP23a\",\"11\",\"\"))))","v":""},{"$f":"IF(ISBLANK(CEFW!$F$21),\"\",CEFW!$F$21)","v":0},{"$f":"IF(ISBLANK('CRP Data'!D12),\"\",'CRP Data'!D12)","v":""},{"$f":"IF(AND(ISBLANK(CEFW!F14),ISBLANK(CEFW!L14)),\"\",ROUND(SUM(CEFW!F14,CEFW!L14),2))","v":""},{"$f":"IF(AND(ISBLANK(CEFW!F16),ISBLANK(CEFW!L16)),\"\",ROUND(SUM(CEFW!F16,CEFW!L16),2))","v":""},{"$f":"IF(AND(ISBLANK(CEFW!F24),ISBLANK(CEFW!L45)),\"\",ROUND(SUM(CEFW!F24,CEFW!L24),2))","v":""},{"$f":"IF(AND(ISBLANK(CEFW!F18),ISBLANK(CEFW!L18)),\"\",ROUND(SUM(CEFW!F18,CEFW!L18),2))","v":""},{"$f":"IF('CRP Data'!$L$39=\"\",\"\",ROUND('CRP Data'!$L$39,2))","v":0},{"$f":"IF(ISBLANK(CEFW!J42),\"\",ROUND(CEFW!J42,2))","v":0},{"$f":"IF(ISBLANK(CEFW!J39),\"\",ROUND(CEFW!J39,2))","v":0},{"$f":"IF(ISBLANK(CEFW!J40),\"\",ROUND(CEFW!J40,2))","v":0},{"$f":"IF(AND(NOT(ISBLANK(CEFW!$H$14)),NOT(ISBLANK(CEFW!$F$24)),NOT(ISBLANK(CEFW!$N$14)),NOT(ISBLANK(CEFW!$L$24))),SUM(ROUND(CEFW!$F$24,2)*CEFW!$H$14,ROUND(CEFW!$L$24,2)*CEFW!$N$14),\nIF(AND(NOT(ISBLANK(CEFW!$H$14)),NOT(ISBLANK(CEFW!$F$24))),(ROUND(CEFW!$F$24,2)*CEFW!$H$14),\"\"))","v":""},{"$f":"IF(ISBLANK(CEFW!J38),\"\",ROUND(CEFW!J38,2))","v":0},{"$f":"IF(ISBLANK('Application Form'!C17),\"\",'Application Form'!C17)","v":""},null,null,{"$f":"IF(ISBLANK('CRP Data'!$G$12),\"\",('CRP Data'!$G$12))","v":""},{"$f":"IF(ISBLANK('CRP Data'!$J$12),\"\",('CRP Data'!$J$12))","v":""},{"$f":"IF(ISBLANK('CRP Data'!$D$30),\"\",('CRP Data'!$D$30))","v":""},{"$f":"IF(AND('Program Eligibility Form'!S38=TRUE,'Min Size Waiver'!R51=TRUE),TRUE,\"\")","v":""},{"$f":"'Instructions - Menu'!$G$5","v":"EasApp_v07"},{"$f":"LastModified()","v":"2019-07-31T16:46:06"}]

{"sheet":"ApplicationQuestion","index":13,"n_rows":14,"n_cols":4,"rows_kept":14,"cut":false,"hidden":true,"merged":[]}
["DESCRIPTOR","YESNO_IND","OPTION_VALUES","LONG_ANSWER"]
["DEED_ENCUMBRANCE",{"$f":"IF('Questionnaire & Assessment'!Q11=TRUE,TRUE,IF('Questionnaire & Assessment'!R11=TRUE,FALSE,\"\"))","v":""},{"$f":"IF(COUNTIF('Questionnaire & Assessment'!S11:W11,\"<>TRUE\")=5,\"                                                                                                                                                      \"&\"                                                                                                                                                      \",ConcatenateIf('Questionnaire & Assessment'!S11:W11,TRUE,'Questionnaire & Assessment'!S10:W10,\";\"))","v":"                                                                                                                                                                                                                                                                                                            "},{"$f":"IF(ISBLANK('Questionnaire & Assessment'!I12),\"                                                                                                                                                      \"&\"                                                                                                                                                      \",'Questionnaire & Assessment'!I12)","v":"                                                                                                                                                                                                                                                                                                            "}]
["WELLS",{"$f":"IF('Questionnaire & Assessment'!Q14=TRUE,TRUE,IF('Questionnaire & Assessment'!R14=TRUE,FALSE,\"\"))","v":""},{"$f":"IF(COUNTIF('Questionnaire & Assessment'!S14:U14,\"<>TRUE\")=3,\"\",ConcatenateIf('Questionnaire & Assessment'!S14:U14,TRUE,'Questionnaire & Assessment'!S13:U13,\";\"))","v":""}]
["MINERAL_RIGHTS",{"$f":"IF('Questionnaire & Assessment'!Q18=TRUE,TRUE,IF('Questionnaire & Assessment'!R18=TRUE,FALSE,\"\"))","v":""},{"$f":"IF(COUNTIF('Questionnaire & Assessment'!S18:V18,\"<>TRUE\")=4,\"\",ConcatenateIf('Questionnaire & Assessment'!S18:V18,TRUE,'Questionnaire & Assessment'!S17:V17,\";\"))","v":""}]
["PLATTED_SUBDIVISION",{"$f":"IF('Questionnaire & Assessment'!Q22=TRUE,TRUE,IF('Questionnaire & Assessment'!R22=TRUE,FALSE,\"\"))","v":""}]
["NONCOMPLIANT",{"$f":"IF('Questionnaire & Assessment'!Q25=TRUE,TRUE,IF('Questionnaire & Assessment'!R25=TRUE,FALSE,\"\"))","v":""}]
{"$rows_left_out":9}
{"sheet":"ApplicationPractice","index":14,"n_rows":5,"n_cols":14,"rows_kept":5,"cut":false,"hidden":true,"merged":[]}
["PRACTICE_CODE","ACRES","CONTRACT_PAYMENT","SIGNUP_INCENTIVE_PAYMENT","SCORE_TOTAL","LOCATION","SPATIAL_RELATIONSHIP","LINEAR_CORRIDOR","LENGTH","WIDTH","RESTORATION_BENEFITS","ECOLOGICAL_HABITAT","ADDITIONAL_WILDLIFE","ADDITIONAL_CONSIDERATIONS"]
["CP2",{"$f":"IF(ISBLANK('CRP Data'!$E$35),\"\",ROUND('CRP Data'!$E$35,2))","v":0},{"$f":"IF('CRP Data'!$F$35=\"\",\"\",ROUND('CRP Data'!$F$35,2))","v":""},{"$f":"IF(OR(ISBLANK('CRP Data'!$I$35),'CRP Data'!$I$35=\"\"),\"\",ROUND('CRP Data'!$I$35,2))","v":0},{"$f":"IF(ISBLANK('CP2 Scoring'!$O$10),\"\",'CP2 Scoring'!$O$10)","v":0},{"$f":"IF(ISBLANK('CP2 Scoring'!$O$12),\"\",'CP2 Scoring'!$O$12)","v":0},{"$f":"IF(ISBLANK('CP2 Scoring'!$O$18),\"\",'CP2 Scoring'!$O$18)","v":0}]
["CP21",{"$f":"IF(ISBLANK('CRP Data'!$E$36),\"\",ROUND('CRP Data'!$E$36,2))","v":0},{"$f":"IF('CRP Data'!$F$36=\"\",\"\",ROUND('CRP Data'!$F$36,2))","v":""},{"$f":"IF(OR(ISBLANK('CRP Data'!$I$36),'CRP Data'!$I$36=\"\"),\"\",ROUND('CRP Data'!$I$36,2))","v":0},{"$f":"IF(ISBLANK('CP21 Scoring'!$O$10),\"\",'CP21 Scoring'!$O$10)","v":0},{"$f":"IF(ISBLANK('CP21 Scoring'!$O$13),\"\",'CP21 Scoring'!$O$13)","v":0},null,{"$f":"IF(ISBLANK('CP21 Scoring'!$O$20),\"\",'CP21 Scoring'!$O$20)","v":0},{"$f":"IF(ISBLANK('CP21 Scoring'!$O$26),\"\",'CP21 Scoring'!$O$26)","v":0},{"$f":"IF(ISBLANK('CP21 Scoring'!$O$40),\"\",'CP21 Scoring'!$O$40)","v":0}]
["CP23",{"$f":"IF(ISBLANK('CRP Data'!$E$37),\"\",ROUND('CRP Data'!$E$37,2))","v":0},{"$f":"IF('CRP Data'!$F$37=\"\",\"\",ROUND('CRP Data'!$F$37,2))","v":""},{"$f":"IF(OR(ISBLANK('CRP Data'!$I$37),'CRP Data'!$I$37=\"\"),\"\",ROUND('CRP Data'!$I$37,2))","v":0},{"$f":"IF(ISBLANK('CP23 Scoring'!$P$10),\"\",'CP23 Scoring'!$P$10)","v":0},null,null,null,null,null,{"$f":"IF(ISBLANK('CP23 Scoring'!$P$12),\"\",'CP23 Scoring'!$P$12)","v":0},{"$f":"IF(ISBLANK('CP23 Scoring'!$P$40),\"\",'CP23 Scoring'!$P$40)","v":0},{"$f":"IF(ISBLANK('CP23 Scoring'!$P$54),\"\",'CP23 Scoring'!$P$54)","v":0},{"$f":"IF(ISBLANK('CP23 Scoring'!$P$60),\"\",'CP23 Scoring'!$P$60)","v":0}]
["CP23A",{"$f":"IF(ISBLANK('CRP Data'!$E$38),\"\",ROUND('CRP Data'!$E$38,2))","v":0},{"$f":"IF('CRP Data'!$F$38=\"\",\"\",ROUND('CRP Data'!$F$38,2))","v":""},{"$f":"IF(OR(ISBLANK('CRP Data'!$I$38),'CRP Data'!$I$38=\"\"),\"\",ROUND('CRP Data'!$I$38,2))","v":0},{"$f":"IF(ISBLANK('CP23a Scoring'!$P$10),\"\",'CP23a Scoring'!$P$10)","v":0},null,null,null,null,null,{"$f":"IF(ISBLANK('CP23a Scoring'!$P$12),\"\",'CP23a Scoring'!$P$12)","v":0},{"$f":"IF(ISBLANK('CP23a Scoring'!$P$40),\"\",'CP23a Scoring'!$P$40)","v":0},{"$f":"IF(ISBLANK('CP23a Scoring'!$P$53),\"\",'CP23a Scoring'!$P$53)","v":0},{"$f":"IF(ISBLANK('CP23a Scoring'!$P$59),\"\",'CP23a Scoring'!$P$59)","v":0}]

{"sheet":"Lists","index":15,"n_rows":92,"n_cols":2,"rows_kept":92,"cut":false,"hidden":true,"merged":[]}
["SWCD_CODE","SWCD_DESC"]
["01","Aitkin"]
["02","Anoka"]
["03","Becker"]
["04","Beltrami"]
["05","Benton"]
{"$rows_left_out":86}